Reaction Details
TargetBeta-secretase 1
LigandBDBM165916
Substrate/Competitorn/a
Meas. Tech.ELISA Assay
IC50 62±n/a nM
Citation Hilpert, HRogers-Evans, MRombach, D 1,4 thiazepines/sulfones as BACE1 and/or BACE2 inhibitors US Patent US9067924 Publication Date 6/30/2015
 
Beta-secretase 1
Name:Beta-secretase 1
Type:Enzyme
Mol. Mass.:55739.56
Organism:Mus musculus (Mouse)
Description:P56818
Residue:501
BDBM165916
NameBDBM165916
Synonyms:US9067924, 10
TypeSmall organic molecule
Emp. Form.C20H22F2N4O3S
Mol. Mass.436.475
SMILESCC1(C)C(N)=N[C@@](C)(CCS1(=O)=O)c1cc(NC(=O)c2ccc(F)cn2)ccc1F