Reaction Details
TargetMaternal embryonic leucine zipper kinase
LigandBDBM166069
Substrate/Competitorn/a
Meas. Tech.Kinase Assay
pH7.4±n/a
Temperature298.15±n/a K
IC50 1±n/a nM
Commentsextracted
Citation Matsuo, YHisada, SNakamura, YAhmed, FWalker, JRHuntley, R 1,5-naphthyridine derivatives and MELK inhibitors containing the same US Patent US9067937 Publication Date 6/30/2015
 
Maternal embryonic leucine zipper kinase
Name:Maternal embryonic leucine zipper kinase
Type:Enzyme
Mol. Mass.:74665.45
Organism:Homo sapiens (Human)
Description:Q14680
Residue:651
BDBM166069
NameBDBM166069
Synonyms:US9067937, 12
TypeSmall organic molecule
Emp. Form.C24H28Cl2N4O3S
Mol. Mass.523.475
SMILESCN(C)C[C@H]1CC[C@@H](CC1)Nc1c(cnc2ccc(nc12)-c1cc(Cl)c(O)c(Cl)c1)S(C)(=O)=O