Reaction Details
TargetMaternal embryonic leucine zipper kinase
LigandBDBM166071
Substrate/Competitorn/a
Meas. Tech.Kinase Assay
pH7.4±n/a
Temperature298.15±n/a K
IC50 0.9±n/a nM
Commentsextracted
Citation Matsuo, YHisada, SNakamura, YAhmed, FWalker, JRHuntley, R 1,5-naphthyridine derivatives and MELK inhibitors containing the same US Patent US9067937 Publication Date 6/30/2015
 
Maternal embryonic leucine zipper kinase
Name:Maternal embryonic leucine zipper kinase
Type:Enzyme
Mol. Mass.:74665.45
Organism:Homo sapiens (Human)
Description:Q14680
Residue:651
BDBM166071
NameBDBM166071
Synonyms:US9067937, 14
TypeSmall organic molecule
Emp. Form.C25H31ClN4O4S
Mol. Mass.519.056
SMILESCOc1cc(cc(Cl)c1O)-c1ccc2ncc(c(N[C@H]3CC[C@H](CN(C)C)CC3)c2n1)S(C)(=O)=O