Reaction Details
TargetMaternal embryonic leucine zipper kinase
LigandBDBM166118
Substrate/Competitorn/a
Meas. Tech.Kinase Assay
pH7.4±n/a
Temperature298.15±n/a K
IC50 0.9±n/a nM
Commentsextracted
Citation Matsuo, YHisada, SNakamura, YAhmed, FWalker, JRHuntley, R 1,5-naphthyridine derivatives and MELK inhibitors containing the same US Patent US9067937 Publication Date 6/30/2015
 
Maternal embryonic leucine zipper kinase
Name:Maternal embryonic leucine zipper kinase
Type:Enzyme
Mol. Mass.:74665.45
Organism:Homo sapiens (Human)
Description:Q14680
Residue:651
BDBM166118
NameBDBM166118
Synonyms:US9067937, 62
TypeSmall organic molecule
Emp. Form.C27H30ClFN4O2
Mol. Mass.497.004
SMILESCC(=O)c1cnc2ccc(nc2c1N[C@H]1CC[C@H](CN2CCCC2)CC1)-c1cc(F)c(O)c(Cl)c1