Reaction Details
TargetMaternal embryonic leucine zipper kinase
LigandBDBM166145
Substrate/Competitorn/a
Meas. Tech.Kinase Assay
pH7.4±n/a
Temperature298.15±n/a K
IC50 0.6±n/a nM
Commentsextracted
Citation Matsuo, YHisada, SNakamura, YAhmed, FWalker, JRHuntley, R 1,5-naphthyridine derivatives and MELK inhibitors containing the same US Patent US9067937 Publication Date 6/30/2015
 
Maternal embryonic leucine zipper kinase
Name:Maternal embryonic leucine zipper kinase
Type:Enzyme
Mol. Mass.:74665.45
Organism:Homo sapiens (Human)
Description:Q14680
Residue:651
BDBM166145
NameBDBM166145
Synonyms:US9067937, 89
TypeSmall organic molecule
Emp. Form.C25H28Cl2N4O2
Mol. Mass.487.421
SMILESCN(C)[C@H]1CC[C@H](CNc2c(cnc3ccc(nc23)-c2cc(Cl)c(O)c(Cl)c2)C(C)=O)CC1