Reaction Details
TargetcAMP-specific 3',5'-cyclic phosphodiesterase 4B
LigandBDBM123687
Substrate/Competitorn/a
Meas. Tech.Inhibition Assay
pH7.5±n/a
IC50>4000±n/a nM
Commentsextracted
Citation Böss, FErb, CHendrix, MVan Kampen, MWunder, F Selective phosphodiesterase 9A inhibitors as medicaments for improving cognitive processes US Patent US9067945 Publication Date 6/30/2015
 
cAMP-specific 3',5'-cyclic phosphodiesterase 4B
Name:cAMP-specific 3',5'-cyclic phosphodiesterase 4B
Type:Protein
Mol. Mass.:83318.87
Organism:Homo sapiens (Human)
Description:Q07343
Residue:736
BDBM123687
NameBDBM123687
Synonyms:US8741907, 3 | US9067945, 2
TypeSmall organic molecule
Emp. Form.C17H26N4O
Mol. Mass.302.4145
SMILESCCC(CC)n1ncc2c1nc(CC1CCCCC1)[nH]c2=O