Reaction Details
Target5-hydroxytryptamine receptor 6
LigandBDBM166358
Substrate/Competitorn/a
Meas. Tech.Radioligand Binding Assay
pH7.5±n/a
Temperature298.15±n/a K
Ki 0.11±n/a nM
Commentsextracted
Citation Guzzo, PRHenderson, AJIsherwood, MLee, CYGhosh, AZhao, H Benzofuro[3,2-c] pyridines and related analogs as serotonin sub-type 6 (5-HT6) modulators for the treatment of obesity, metabolic syndrome, cognition and schizophrenia US Patent US9067949 Publication Date 6/30/2015
 
5-hydroxytryptamine receptor 6
Name:5-hydroxytryptamine receptor 6
Type:G Protein-Coupled Receptor (GPCR)
Mol. Mass.:46968.43
Organism:Homo sapiens (Human)
Description:P50406
Residue:440
BDBM166358
NameBDBM166358
Synonyms:US9067949, 215
TypeSmall organic molecule
Emp. Form.C19H19NO4S
Mol. Mass.357.423
SMILESCCOc1cc(cc2c3CNCCc3oc12)S(=O)(=O)c1ccccc1