Reaction Details
TargetArachidonate 5-lipoxygenase-activating protein
LigandBDBM167067
Substrate/Competitorn/a
Meas. Tech.Homogeneous Time Resolved Fluorescence Assay
Ki 2.3±n/a nM
Citation Eccles, WFitzgerald, AEHack, MDHawryluk, NAJones, WMKeith, JMKrawczuk, PLebsack, ADLiu, JMani, NSMcClure, KJMeduna, SPRosen, MD Flap modulators US Patent US9073876 Publication Date 7/7/2015
 
Arachidonate 5-lipoxygenase-activating protein
Name:Arachidonate 5-lipoxygenase-activating protein
Type:Enzyme
Mol. Mass.:18159.90
Organism:Homo sapiens (Human)
Description:P20292
Residue:161
BDBM167067
NameBDBM167067
Synonyms:US9073876, 153 | US9732093, Compound 153
TypeSmall organic molecule
Emp. Form.C21H18FN3O3
Mol. Mass.379.3843
SMILESNc1cnc(cn1)-c1ccc(C2CCC2)c(Oc2ccc(cc2)C(O)=O)c1F