Reaction Details
TargetATP-sensitive inward rectifier potassium channel 1
LigandBDBM167405
Substrate/Competitorn/a
Meas. Tech.Thallium Flux Assay
Temperature277.15±n/a K
IC50 17±n/a nM
Commentsextracted
Citation Tang, HPasternak, AYang, LWalsh, SPPio, BShahripour, ATeumelsan, N Inhibitors of the renal outer medullary potassium channel US Patent US9073882 Publication Date 7/7/2015
 
ATP-sensitive inward rectifier potassium channel 1
Name:ATP-sensitive inward rectifier potassium channel 1
Type:Enzyme Catalytic Domain
Mol. Mass.:44809.08
Organism:Homo sapiens (Human)
Description:gi_223460826
Residue:391
BDBM167405
NameBDBM167405
Synonyms:US9073882, 86
TypeSmall organic molecule
Emp. Form.C24H25ClFN3O2
Mol. Mass.441.926
SMILESCc1c2COC(=O)c2ccc1CCN1CCN(CCc2ccc(C#N)c(F)c2Cl)CC1