Reaction Details
TargetAurora kinase B/Inner centromere protein
LigandBDBM167510
Substrate/Competitorn/a
Meas. Tech.Radioactive Assay
IC50 4±n/a nM
Citation Carry, JCheve, MClerc, FCombeau, CGontier, SKrick, ALachaud, SSchio, L Anti-cancer compound and pharmaceutical composition containing the same US Patent US9073917 Publication Date 7/7/2015
 
Aurora kinase B/Inner centromere protein
Name:Aurora kinase B/Inner centromere protein
Synonyms:Aurora B/Incenp
Type:Protein Complex
Mol. Mass.:n/a
Description:n/a
Components:This complex has 2 components.
Component 1
Name:Aurora kinase B
Type:Protein
Mol. Mass.:39327.72
Organism:Homo sapiens (Human)
Description:Q96GD4
Residue:344
Component 2
Name:Inner centromere protein
Synonyms:INCENP | INCE_HUMAN
Type:Protein
Mol. Mass.:105461.33
Organism:Homo sapiens (Human)
Description:Q9NQS7
Residue:918
BDBM167510
NameBDBM167510
Synonyms:US9073917, 7- comparative
TypeSmall organic molecule
Emp. Form.C28H28N4O2
Mol. Mass.452.5475
SMILESCCc1[nH]cc2C(C3=C(CC(C)(C)CC3=O)Nc12)c1cccc(Oc2nc3ccccc3[nH]2)c1