Reaction Details
TargetAurora kinase B/Inner centromere protein
LigandBDBM167512
Substrate/Competitorn/a
Meas. Tech.Radioactive Assay
IC50 107±n/a nM
Citation Carry, JCheve, MClerc, FCombeau, CGontier, SKrick, ALachaud, SSchio, L Anti-cancer compound and pharmaceutical composition containing the same US Patent US9073917 Publication Date 7/7/2015
 
Aurora kinase B/Inner centromere protein
Name:Aurora kinase B/Inner centromere protein
Synonyms:Aurora B/Incenp
Type:Protein Complex
Mol. Mass.:n/a
Description:n/a
Components:This complex has 2 components.
Component 1
Name:Aurora kinase B
Type:Protein
Mol. Mass.:39327.72
Organism:Homo sapiens (Human)
Description:Q96GD4
Residue:344
Component 2
Name:Inner centromere protein
Synonyms:INCENP | INCE_HUMAN
Type:Protein
Mol. Mass.:105461.33
Organism:Homo sapiens (Human)
Description:Q9NQS7
Residue:918
BDBM167512
NameBDBM167512
Synonyms:US9073917, 11- comparative | US9073917, 9- comparative
TypeSmall organic molecule
Emp. Form.C25H23N5OS
Mol. Mass.441.548
SMILESCCc1[nH]cc2C(C3=C(CNCC3=O)Nc12)c1cccc(Sc2nc3ccccc3[nH]2)c1