Reaction Details
TargetCyclin-dependent kinase 9
LigandBDBM167699
Substrate/Competitorn/a
Meas. Tech.LANCE ULight TR-FRET Kinase Assay
IC50 4±n/a nM
Citation Gong, JTao, ZPenning, TDSouers, AJTong, YZhu, G Pyrrolo[2,3-B]pyridine CDK9 kinase inhibitors US Patent US9073922 Publication Date 7/7/2015
 
Cyclin-dependent kinase 9
Name:Cyclin-dependent kinase 9
Type:Enzyme Subunit
Mol. Mass.:42789.13
Organism:Homo sapiens (Human)
Description:n/a
Residue:372
BDBM167699
NameBDBM167699
Synonyms:US9073922, 186 | US9796708, Example 186
TypeSmall organic molecule
Emp. Form.C22H24FN3O3
Mol. Mass.397.4427
SMILESCOc1ccc(F)cc1-c1ccnc2[nH]c(cc12)C1=CCN(CC(O)CO)CC1