Reaction Details
TargetTyrosine-protein phosphatase non-receptor type 1
LigandBDBM50346601
Substrate/Competitorn/a
Meas. Tech.Colorimetric Assay
pH6.5±n/a
IC50 1.95e+3± 2.9e+2 nM
Commentsextracted
Citation Wang, WLChen, XGao, LXSheng, LLi, JYLi, JFeng, B Synthesis of novel 3-aryl-1-oxa-2,8-diazaspiro[4.5]dec-2-ene derivatives and their biological evaluation against protein tyrosine phosphatase 1B. Chem Biol Drug Des86:1161-7 (2015) 
 
Tyrosine-protein phosphatase non-receptor type 1
Name:Tyrosine-protein phosphatase non-receptor type 1
Type:Protein phosphatase
Mol. Mass.:49963.76
Organism:Homo sapiens (Human)
Description:Human recombinant GST-fusion PTP1B (1-435).
Residue:435
BDBM50346601
NameBDBM50346601
Synonyms:NSC-114945 Oleanolic acid US11660306, Example Oleanolic acid
TypeSmall organic molecule
Emp. Form.C30H48O3
Mol. Mass.456.7003
SMILESCC1(C)CC[C@@]2(CC[C@]3(C)C(=CC[C@@H]4[C@@]5(C)CC[C@H](O)C(C)(C)[C@@H]5CC[C@@]34C)[C@@H]2C1)C(O)=O