Reaction Details
TargetDipeptidyl peptidase 4 [K6R,T557I]
LigandBDBM167938
Substrate/Competitorn/a
Meas. Tech.DPP-IV Inhibition Activity
Temperature298.15±n/a K
IC50 15±0.0 nM
Commentsextracted
Citation Gomha, SMEldebss, TMBadrey, MGAbdulla, MMMayhoub, AS Novel 4-heteroaryl-antipyrines as DPP-IV inhibitors. Chem Biol Drug Des86:1292-303 (2015) 
 
Dipeptidyl peptidase 4 [K6R,T557I]
Name:Dipeptidyl peptidase 4 [K6R,T557I]
Type:Protein
Mol. Mass.:88325.11
Organism:Homo sapiens (Human)
Description:P27487[K6R,T557I]
Residue:766
BDBM167938
NameBDBM167938
Synonyms:1',5'-Dimethyl-2'-phenyl-5-(phenylsulfonyl)-1'H,2H-[3,4'-bipyrazol]-3'(2'H)-one (18)
TypeSmall organic molecule
Emp. Form.C20H18N4O3S
Mol. Mass.394.447
SMILESCc1c(-c2cc(n[nH]2)S(=O)(=O)c2ccccc2)c(=O)n(-c2ccccc2)n1C