Reaction Details
TargetDipeptidyl peptidase 4 [K6R,T557I]
LigandBDBM11162
Substrate/Competitorn/a
Meas. Tech.DPP-IV Inhibition Activity
Temperature298.15±n/a K
IC50 11±0.0 nM
Commentsextracted
Citation Gomha, SMEldebss, TMBadrey, MGAbdulla, MMMayhoub, AS Novel 4-heteroaryl-antipyrines as DPP-IV inhibitors. Chem Biol Drug Des86:1292-303 (2015) 
 
Dipeptidyl peptidase 4 [K6R,T557I]
Name:Dipeptidyl peptidase 4 [K6R,T557I]
Type:Protein
Mol. Mass.:88325.11
Organism:Homo sapiens (Human)
Description:P27487[K6R,T557I]
Residue:766
BDBM11162
NameBDBM11162
Synonyms:(1R)-3-oxo-3-[3-(trifluoroethyl)-5,6-dihydro[1,2,4]triazolo[4,3-a]pyrazin-7(8H)-yl]-1-(2,4,5-trifluorobenzyl)propylamine CHEMBL393336 Sitagliptin Triazolopiperazine Analogue 1 | US10479798, Compound MK0431
TypeSmall organic molecule
Emp. Form.C16H15F6N5O
Mol. Mass.407.3136
SMILESN[C@@H](CC(=O)N1CCn2c(C1)nnc2C(F)(F)F)Cc1cc(F)c(F)cc1F