Reaction Details
TargetVascular endothelial growth factor receptor 2
LigandBDBM167956
Substrate/Competitorn/a
Meas. Tech.VEGFR2 Kinase Assay
pH7.2±n/a
Temperature298.15±n/a K
IC50 8.42±0.0 nM
Commentsextracted
Citation Yin, YSha, SWang, YTWu, XWang, SFQiao, FLv, PCZhu, HL Discovery of new 4-alkoxyquinazoline-based derivatives as potent VEGFR2 inhibitors. Chem Biol Drug Des86:1323-9 (2015) 
 
Vascular endothelial growth factor receptor 2
Name:Vascular endothelial growth factor receptor 2
Type:Receptor Tyrosine Kinase
Mol. Mass.:151510.97
Organism:Homo sapiens (Human)
Description:P35968
Residue:1356
BDBM167956
NameBDBM167956
Synonyms:1-(4-(3,4-Dichlorophenyl)piperazin-1-yl)-3-(quinazolin-4-yloxy)propan-2-ol (3l)
TypeSmall organic molecule
Emp. Form.C21H22Cl2N4O2
Mol. Mass.433.331
SMILESOC(COc1ncnc2ccccc12)CN1CCN(CC1)c1ccc(Cl)c(Cl)c1