Reaction Details
TargetFibroblast growth factor 2
LigandBDBM167951
Substrate/Competitorn/a
Meas. Tech.VEGFR2 Kinase Assay
pH7.2±n/a
Temperature298.15±n/a K
IC50 208.54±0.0 nM
Commentsextracted
Citation Yin, YSha, SWang, YTWu, XWang, SFQiao, FLv, PCZhu, HL Discovery of new 4-alkoxyquinazoline-based derivatives as potent VEGFR2 inhibitors. Chem Biol Drug Des86:1323-9 (2015) 
 
Fibroblast growth factor 2
Name:Fibroblast growth factor 2
Type:Protein
Mol. Mass.:30803.89
Organism:Homo sapiens (Human)
Description:P09038
Residue:288
BDBM167951
NameBDBM167951
Synonyms:1-(4-(2-Methoxyphenyl)piperazin-1-yl)-3-(quinazolin-4-yloxy)propan-2-ol (3g)
TypeSmall organic molecule
Emp. Form.C22H26N4O3
Mol. Mass.394.4668
SMILESCOc1ccccc1N1CCN(CC(O)COc2ncnc3ccccc23)CC1