Reaction Details
TargetFibroblast growth factor 2
LigandBDBM167957
Substrate/Competitorn/a
Meas. Tech.VEGFR2 Kinase Assay
pH7.2±n/a
Temperature298.15±n/a K
IC50 221.64±0.0 nM
Commentsextracted
Citation Yin, YSha, SWang, YTWu, XWang, SFQiao, FLv, PCZhu, HL Discovery of new 4-alkoxyquinazoline-based derivatives as potent VEGFR2 inhibitors. Chem Biol Drug Des86:1323-9 (2015) 
 
Fibroblast growth factor 2
Name:Fibroblast growth factor 2
Type:Protein
Mol. Mass.:30803.89
Organism:Homo sapiens (Human)
Description:P09038
Residue:288
BDBM167957
NameBDBM167957
Synonyms:1-(4-(2,4-Dimethylphenyl)piperazin-1-yl)-3-(quinazolin-4-yloxy)propan-2-ol (3m)
TypeSmall organic molecule
Emp. Form.C23H28N4O2
Mol. Mass.392.494
SMILESCc1ccc(N2CCN(CC(O)COc3ncnc4ccccc34)CC2)c(C)c1