Reaction Details
TargetFibroblast growth factor 2
LigandBDBM167958
Substrate/Competitorn/a
Meas. Tech.VEGFR2 Kinase Assay
pH7.2±n/a
Temperature298.15±n/a K
IC50 443.92±0.0 nM
Commentsextracted
Citation Yin, YSha, SWang, YTWu, XWang, SFQiao, FLv, PCZhu, HL Discovery of new 4-alkoxyquinazoline-based derivatives as potent VEGFR2 inhibitors. Chem Biol Drug Des86:1323-9 (2015) 
 
Fibroblast growth factor 2
Name:Fibroblast growth factor 2
Type:Protein
Mol. Mass.:30803.89
Organism:Homo sapiens (Human)
Description:P09038
Residue:288
BDBM167958
NameBDBM167958
Synonyms:1-(4-Benzylpiperazin-1-yl)-3-(quinazolin-4-yloxy)propan-2-ol (3n)
TypeSmall organic molecule
Emp. Form.C22H26N4O2
Mol. Mass.378.4674
SMILESOC(COc1ncnc2ccccc12)CN1CCN(Cc2ccccc2)CC1