Reaction Details
TargetPlatelet-derived growth factor receptor beta
LigandBDBM167952
Substrate/Competitorn/a
Meas. Tech.VEGFR2 Kinase Assay
pH7.2±n/a
Temperature298.15±n/a K
IC50 54.42±0.0 nM
Commentsextracted
Citation Yin, YSha, SWang, YTWu, XWang, SFQiao, FLv, PCZhu, HL Discovery of new 4-alkoxyquinazoline-based derivatives as potent VEGFR2 inhibitors. Chem Biol Drug Des86:1323-9 (2015) 
 
Platelet-derived growth factor receptor beta
Name:Platelet-derived growth factor receptor beta
Type:Enzyme
Mol. Mass.:123922.25
Organism:Homo sapiens (Human)
Description:P09619
Residue:1106
BDBM167952
NameBDBM167952
Synonyms:1-(4-(3-Methoxyphenyl)piperazin-1-yl)-3-(quinazolin-4-yloxy)propan-2-ol (3h)
TypeSmall organic molecule
Emp. Form.C22H26N4O3
Mol. Mass.394.4668
SMILESCOc1cccc(c1)N1CCN(CC(O)COc2ncnc3ccccc23)CC1