Reaction Details
TargetPlatelet-derived growth factor receptor beta
LigandBDBM167955
Substrate/Competitorn/a
Meas. Tech.VEGFR2 Kinase Assay
pH7.2±n/a
Temperature298.15±n/a K
IC50 198.62±0.0 nM
Commentsextracted
Citation Yin, YSha, SWang, YTWu, XWang, SFQiao, FLv, PCZhu, HL Discovery of new 4-alkoxyquinazoline-based derivatives as potent VEGFR2 inhibitors. Chem Biol Drug Des86:1323-9 (2015) 
 
Platelet-derived growth factor receptor beta
Name:Platelet-derived growth factor receptor beta
Type:Enzyme
Mol. Mass.:123922.25
Organism:Homo sapiens (Human)
Description:P09619
Residue:1106
BDBM167955
NameBDBM167955
Synonyms:1-(4-(2,3-Dichlorophenyl)piperazin-1-yl)-3-(quinazolin-4-yloxy)propan-2-ol (3k)
TypeSmall organic molecule
Emp. Form.C21H22Cl2N4O2
Mol. Mass.433.331
SMILESOC(COc1ncnc2ccccc12)CN1CCN(CC1)c1cccc(Cl)c1Cl