Reaction Details
TargetRibosomal protein S6 kinase alpha-3
LigandBDBM168038
Substrate/Competitorn/a
Meas. Tech.Kinase Glo Assay
pH7.5±n/a
IC50 26.5±n/a nM
Commentsextracted
Citation Boyer, SJBurke, JGuo, XKirrane, Jr., TMSnow, RJZhang, Y Heterocyclic compounds containing a pyrrolopyridine or benzimidazole core US Patent US9073926 Publication Date 7/7/2015
 
Ribosomal protein S6 kinase alpha-3
Name:Ribosomal protein S6 kinase alpha-3
Type:Serine/threonine-protein kinase
Mol. Mass.:83740.03
Organism:Homo sapiens (Human)
Description:The human RSK2 sequence differed from the Genbank entry NM_004586 at one residue, V45G. The protein was cloned and purified from baculovirus expression system.
Residue:740
BDBM168038
NameBDBM168038
Synonyms:US9073926, 72
TypeSmall organic molecule
Emp. Form.C21H20N6O2
Mol. Mass.388.4225
SMILESCCn1c(NC(=O)c2ccc3cc4C(=O)NC[C@@H](C)n4c3n2)nc2ccccc12