Reaction Details
TargetOxysterols receptor LXR-alpha
LigandBDBM168122
Substrate/Competitorn/a
Meas. Tech.Radioligand Binding Assay
Temperature298.15±n/a K
Ki 26±n/a nM
Commentsextracted
Citation Leftheris, KZhuang, L Liver X receptor modulators US Patent US9073931 Publication Date 7/7/2015
 
Oxysterols receptor LXR-alpha
Name:Oxysterols receptor LXR-alpha
Type:Enzyme Catalytic Domain
Mol. Mass.:50403.85
Organism:Homo sapiens (Human)
Description:Q13133
Residue:447
BDBM168122
NameBDBM168122
Synonyms:US9073931, E28
TypeSmall organic molecule
Emp. Form.C23H26F3N5O5S
Mol. Mass.541.543
SMILESCCOC(=O)c1cnc(nc1C(F)(F)F)N1CCn2c(nc3cc(CO)c(cc23)S(C)(=O)=O)C1C(C)C