Reaction Details
TargetDual specificity calcium/calmodulin-dependent 3',5'-cyclic nucleotide phosphodiesterase 1A
LigandBDBM168127
Substrate/Competitorn/a
Meas. Tech.Enzyme Assay
pH7.5±n/a
Temperature303.15±n/a K
Ki 4±n/a nM
Commentsextracted
Citation Li, PZheng, HZhao, JWennogle, LP Organic compounds US Patent US9073936 Publication Date 7/7/2015
 
Dual specificity calcium/calmodulin-dependent 3',5'-cyclic nucleotide phosphodiesterase 1A
Name:Dual specificity calcium/calmodulin-dependent 3',5'-cyclic nucleotide phosphodiesterase 1A
Type:Protein
Mol. Mass.:61245.69
Organism:Homo sapiens (Human)
Description:P54750
Residue:535
BDBM168127
NameBDBM168127
Synonyms:US9073936, 2 | US9598426, 2
TypeSmall organic molecule
Emp. Form.C25H27FN6O2
Mol. Mass.462.5193
SMILESCC(O)c1ccc(Cn2nc3N4CC(C)(C)N=C4N(C)C(=O)c3c2Nc2ccc(F)cc2)cc1