Reaction Details
TargetSodium-dependent noradrenaline transporter
LigandBDBM60509
Substrate/Competitorn/a
Meas. Tech.Binding Assay
pH7.4±n/a
Ki 2.6±n/a nM
Commentsextracted
Citation Molino, BFLiu, SGuzzo, PRBeck, JP Aryl- and heteroaryl-substituted tetrahydroisoquinolines and use thereof to block reuptake of norepinephrine, dopamine, and serotonin US Patent US9085531 Publication Date 7/21/2015
 
Sodium-dependent noradrenaline transporter
Name:Sodium-dependent noradrenaline transporter
Type:Multi-pass membrane protein
Mol. Mass.:69337.72
Organism:Homo sapiens (Human)
Description:P23975
Residue:617
BDBM60509
NameBDBM60509
Synonyms:US9085531, 125
Typen/a
Emp. Form.C17H16ClN3
Mol. Mass.297.782
SMILESCN1Cc2ccccc2C(C1Cl)c1ccc2[nH]ncc2c1