Reaction Details
TargetSodium-dependent noradrenaline transporter
LigandBDBM170442
Substrate/Competitorn/a
Meas. Tech.Binding Assay
pH7.4±n/a
Ki 2±n/a nM
Commentsextracted
Citation Molino, BFLiu, SGuzzo, PRBeck, JP Aryl- and heteroaryl-substituted tetrahydroisoquinolines and use thereof to block reuptake of norepinephrine, dopamine, and serotonin US Patent US9085531 Publication Date 7/21/2015
 
Sodium-dependent noradrenaline transporter
Name:Sodium-dependent noradrenaline transporter
Type:Multi-pass membrane protein
Mol. Mass.:69337.72
Organism:Homo sapiens (Human)
Description:P23975
Residue:617
BDBM170442
NameBDBM170442
Synonyms:US9085531, 19
TypeSmall organic molecule
Emp. Form.C18H17NO
Mol. Mass.263.3337
SMILESCN1CC(c2ccccc2C1)c1cccc2ccoc12