Reaction Details
TargetEpidermal growth factor receptor
LigandBDBM170523
Substrate/Competitorn/a
Meas. Tech.Inhibition Assay
IC50 1.2±n/a nM
Citation Matsuya, TKondoh, YShimada, IKikuchi, SIida, MOnda, KFukudome, HTakemoto, YShindou, NSakagami, HHamaguchi, H Pyrazinecarboxamide compound US Patent US9085540 Publication Date 7/21/2015
 
Epidermal growth factor receptor
Name:Epidermal growth factor receptor
Type:Receptor Kinase Domain
Mol. Mass.:134279.59
Organism:Homo sapiens (Human)
Description:P00533
Residue:1210
BDBM170523
NameBDBM170523
Synonyms:US9085540, 63
TypeSmall organic molecule
Emp. Form.C28H33N7O3
Mol. Mass.515.6067
SMILESCCc1nc(C(N)=O)c(Nc2ccc(cc2)N2CCN(C)[C@@H](C)C2)nc1Oc1cccc(NC(=O)C=C)c1