Reaction Details
TargetComplement factor D
LigandBDBM170734
Substrate/Competitorn/a
Meas. Tech.In Vitro Assay
pH7.5±n/a
Temperature298.15±n/a K
IC50 5±n/a nM
Commentsextracted
Citation Altmann, EHommel, ULorthiois, ELMaibaum, JKOstermann, NQuancard, JRandl, SARogel, OSimic, OVulpetti, A Complement pathway modulators and uses thereof US Patent US9085555 Publication Date 7/21/2015
 
Complement factor D
Name:Complement factor D
Type:Protein
Mol. Mass.:27039.19
Organism:Homo sapiens (Human)
Description:P00746
Residue:253
BDBM170734
NameBDBM170734
Synonyms:US9085555, 162
TypeSmall organic molecule
Emp. Form.C26H27ClFN5O5
Mol. Mass.543.974
SMILESCOCCOc1ccc2n(cc(NC(=O)N3C4CC4C[C@H]3C(=O)NCc3cccc(Cl)c3F)c2c1)C(N)=O