Reaction Details
TargetComplement factor D
LigandBDBM170866
Substrate/Competitorn/a
Meas. Tech.In Vitro Assay
pH7.5±n/a
Temperature298.15±n/a K
IC50 5±n/a nM
Commentsextracted
Citation Altmann, EHommel, ULorthiois, ELMaibaum, JKOstermann, NQuancard, JRandl, SARogel, OSimic, OVulpetti, A Complement pathway modulators and uses thereof US Patent US9085555 Publication Date 7/21/2015
 
Complement factor D
Name:Complement factor D
Type:Protein
Mol. Mass.:27039.19
Organism:Homo sapiens (Human)
Description:P00746
Residue:253
BDBM170866
NameBDBM170866
Synonyms:US9085555, 294
TypeSmall organic molecule
Emp. Form.C23H20ClF2N5O3
Mol. Mass.487.886
SMILESNC(=O)n1cc(NC(=O)N2C3CC3C[C@H]2C(=O)NCc2cccc(Cl)c2F)c2cc(F)ccc12