Reaction Details
TargetComplement factor D
LigandBDBM170949
Substrate/Competitorn/a
Meas. Tech.In Vitro Assay
pH7.5±n/a
Temperature298.15±n/a K
IC50 5±n/a nM
Commentsextracted
Citation Altmann, EHommel, ULorthiois, ELMaibaum, JKOstermann, NQuancard, JRandl, SARogel, OSimic, OVulpetti, A Complement pathway modulators and uses thereof US Patent US9085555 Publication Date 7/21/2015
 
Complement factor D
Name:Complement factor D
Type:Protein
Mol. Mass.:27039.19
Organism:Homo sapiens (Human)
Description:P00746
Residue:253
BDBM170949
NameBDBM170949
Synonyms:US9085555, 379
TypeSmall organic molecule
Emp. Form.C25H25ClFN5O5
Mol. Mass.529.948
SMILESNC(=O)n1cc(NC(=O)N2[C@@H]3C[C@@H]3C[C@H]2C(=O)NCc2cccc(Cl)c2F)c2cc(OCCO)ccc12