Reaction Details
TargetComplement factor D
LigandBDBM171208
Substrate/Competitorn/a
Meas. Tech.In Vitro Assay
pH7.5±n/a
Temperature298.15±n/a K
IC50 5±n/a nM
Commentsextracted
Citation Altmann, EHommel, ULorthiois, ELMaibaum, JKOstermann, NQuancard, JRandl, SARogel, OSimic, OVulpetti, A Complement pathway modulators and uses thereof US Patent US9085555 Publication Date 7/21/2015
 
Complement factor D
Name:Complement factor D
Type:Protein
Mol. Mass.:27039.19
Organism:Homo sapiens (Human)
Description:P00746
Residue:253
BDBM171208
NameBDBM171208
Synonyms:US9085555, 638
TypeSmall organic molecule
Emp. Form.C29H25F5N6O6
Mol. Mass.648.5374
SMILESCO[C@@H]1[C@@H](F)CN([C@@H]1C(=O)Nc1cccc(OC(F)(F)F)c1F)C(=O)Cn1nc(C(C)=O)c2cc(OCc3ncccn3)ccc12