Reaction Details
TargetSodium-dependent dopamine transporter
LigandBDBM287939
Substrate/Competitorn/a
Meas. Tech.Assay for Dopamine Reuptake Inhibition
pH7.4±n/a
EC50 46.0±10 nM
Commentsextracted
Citation Ananthan, SRothman, RB Quinazolines as biogenic amine transport modulators US Patent US10087148 Publication Date 10/2/2018
 
Sodium-dependent dopamine transporter
Name:Sodium-dependent dopamine transporter
Type:Multi-pass membrane protein
Mol. Mass.:68497.11
Organism:Homo sapiens (Human)
Description:Q01959
Residue:620
BDBM287939
NameBDBM287939
Synonyms:N-(2-cyclohexyl-2-phenylethyl)-2-(4- (dimethylamino)phenyl)quinazolin-4- amine | US10087148, Example 7
TypeSmall organic molecule
Emp. Form.C30H34N4
Mol. Mass.450.6178
SMILESCN(C)c1ccc(cc1)-c1nc(NCC(C2CCCCC2)c2ccccc2)c2ccccc2n1