Reaction Details
TargetSodium-dependent dopamine transporter
LigandBDBM287942
Substrate/Competitorn/a
Meas. Tech.Assay for Dopamine Reuptake Inhibition
pH7.4±n/a
EC50 4.80±0.6 nM
Commentsextracted
Citation Ananthan, SRothman, RB Quinazolines as biogenic amine transport modulators US Patent US10087148 Publication Date 10/2/2018
 
Sodium-dependent dopamine transporter
Name:Sodium-dependent dopamine transporter
Type:Multi-pass membrane protein
Mol. Mass.:68497.11
Organism:Homo sapiens (Human)
Description:Q01959
Residue:620
BDBM287942
NameBDBM287942
Synonyms:N-(4-(4-((2-phenyl-2-(pyridin-4- yl)ethyl)amino)quinazolin-2- yl)phenyl)methanesulfonamide | US10087148, Example 10
TypeSmall organic molecule
Emp. Form.C28H25N5O2S
Mol. Mass.495.595
SMILESCS(=O)(=O)Nc1ccc(cc1)-c1nc(NCC(c2ccccc2)c2ccncc2)c2ccccc2n1