Reaction Details
TargetSodium-dependent dopamine transporter
LigandBDBM287949
Substrate/Competitorn/a
Meas. Tech.Assay for Dopamine Reuptake Inhibition
pH7.4±n/a
EC50 62.0±20 nM
Commentsextracted
Citation Ananthan, SRothman, RB Quinazolines as biogenic amine transport modulators US Patent US10087148 Publication Date 10/2/2018
 
Sodium-dependent dopamine transporter
Name:Sodium-dependent dopamine transporter
Type:Multi-pass membrane protein
Mol. Mass.:68497.11
Organism:Homo sapiens (Human)
Description:Q01959
Residue:620
BDBM287949
NameBDBM287949
Synonyms:N-(4-(4-((2-phenyl-2-(piperidin-1- yl)ethyl)amino)quinazolin-2- yl)phenyl)methanesulfonamide | US10087148, Example 17
TypeSmall organic molecule
Emp. Form.C28H31N5O2S
Mol. Mass.501.643
SMILESCS(=O)(=O)Nc1ccc(cc1)-c1nc(NCC(N2CCCCC2)c2ccccc2)c2ccccc2n1