Reaction Details
TargetSodium-dependent dopamine transporter
LigandBDBM287960
Substrate/Competitorn/a
Meas. Tech.Assay for Dopamine Reuptake Inhibition
pH7.4±n/a
EC50 18.0±7 nM
Commentsextracted
Citation Ananthan, SRothman, RB Quinazolines as biogenic amine transport modulators US Patent US10087148 Publication Date 10/2/2018
 
Sodium-dependent dopamine transporter
Name:Sodium-dependent dopamine transporter
Type:Multi-pass membrane protein
Mol. Mass.:68497.11
Organism:Homo sapiens (Human)
Description:Q01959
Residue:620
BDBM287960
NameBDBM287960
Synonyms:(5-(2-((2-(4-(dimethylamino)-2- methylphenyl)quinazolin-4-yl)amino)- 1-phenylethyl)-1H-pyrrol-2- yl)methanol | US10087148, Example 28
TypeSmall organic molecule
Emp. Form.C30H31N5O
Mol. Mass.477.6
SMILESCN(C)c1ccc(c(C)c1)-c1nc(NCC(c2ccc(CO)[nH]2)c2ccccc2)c2ccccc2n1