Reaction Details
TargetSodium-dependent dopamine transporter
LigandBDBM287961
Substrate/Competitorn/a
Meas. Tech.Assay for Dopamine Reuptake Inhibition
pH7.4±n/a
EC50 7.40±2 nM
Commentsextracted
Citation Ananthan, SRothman, RB Quinazolines as biogenic amine transport modulators US Patent US10087148 Publication Date 10/2/2018
 
Sodium-dependent dopamine transporter
Name:Sodium-dependent dopamine transporter
Type:Multi-pass membrane protein
Mol. Mass.:68497.11
Organism:Homo sapiens (Human)
Description:Q01959
Residue:620
BDBM287961
NameBDBM287961
Synonyms:N-(3-methyl-4-(4-((2-phenyl-2- (pyridin-4-yl)ethyl)amino)quinazolin-2- yl)phenyl)methanesulfonamide | US10087148, Example 29
TypeSmall organic molecule
Emp. Form.C29H27N5O2S
Mol. Mass.509.622
SMILESCc1cc(NS(C)(=O)=O)ccc1-c1nc(NCC(c2ccccc2)c2ccncc2)c2ccccc2n1