Reaction Details
TargetArachidonate 5-lipoxygenase-activating protein
LigandBDBM145770
Substrate/Competitorn/a
Meas. Tech.Binding Assay
Ki 0.52±n/a nM
Citation Chai, WDvorak, CAEccles, WEdwards, JPGoldberg, SDKrawczuk, PJLebsack, ADLiu, JPippel, DJSales, ZSTanis, VMTichenor, MSWiener, JJ 1,2,6-substituted benzimidazoles as flap modulators US Patent US9089569 Publication Date 7/28/2015
 
Arachidonate 5-lipoxygenase-activating protein
Name:Arachidonate 5-lipoxygenase-activating protein
Type:Enzyme
Mol. Mass.:18159.90
Organism:Homo sapiens (Human)
Description:P20292
Residue:161
BDBM145770
NameBDBM145770
Synonyms:US8952177, 124 US9695149, 124
TypeSmall organic molecule
Emp. Form.C28H25BrF3N3O3
Mol. Mass.588.416
SMILESCc1cnc(COc2ccc3nc([C@H]4CCCC[C@@H]4C(O)=O)n(Cc4c(F)cc(Br)cc4F)c3c2)c(F)c1