Reaction Details
TargetArachidonate 5-lipoxygenase-activating protein
LigandBDBM145822
Substrate/Competitorn/a
Meas. Tech.Binding Assay
Ki 1.2±n/a nM
Citation Chai, WDvorak, CAEccles, WEdwards, JPGoldberg, SDKrawczuk, PJLebsack, ADLiu, JPippel, DJSales, ZSTanis, VMTichenor, MSWiener, JJ 1,2,6-substituted benzimidazoles as flap modulators US Patent US9089569 Publication Date 7/28/2015
 
Arachidonate 5-lipoxygenase-activating protein
Name:Arachidonate 5-lipoxygenase-activating protein
Type:Enzyme
Mol. Mass.:18159.90
Organism:Homo sapiens (Human)
Description:P20292
Residue:161
BDBM145822
NameBDBM145822
Synonyms:US8952177, 178 US9695149, 178
TypeSmall organic molecule
Emp. Form.C34H39FN4O3
Mol. Mass.570.6969
SMILESCC1CCN(CC1)c1ccc(Cn2c(nc3ccc(OCc4ncc(C)cc4F)cc23)[C@@H]2CCCC[C@@H]2C(O)=O)cc1