Reaction Details
TargetHistone-lysine N-methyltransferase EZH2
LigandBDBM172070
Substrate/Competitorn/a
Meas. Tech.Enzyme Assay
Temperature298.15±n/a K
IC50 3.74±n/a nM
Commentsextracted
Citation Kuntz, KWChesworth, RDuncan, KWKeilhack, HWarholic, NKlaus, CKnutson, SKWigle, TJSeki, MShirotori, SKawano, S Aryl- or heteroaryl-substituted benzene compounds US Patent US9090562 Publication Date 7/28/2015
 
Histone-lysine N-methyltransferase EZH2
Name:Histone-lysine N-methyltransferase EZH2
Type:Protein
Mol. Mass.:85367.84
Organism:Homo sapiens (Human)
Description:Q15910
Residue:746
BDBM172070
NameBDBM172070
Synonyms:US10155002, Compound 76 US9090562, 76
TypeSmall organic molecule
Emp. Form.C35H46N4O4
Mol. Mass.586.7641
SMILESCCN(C1CCOCC1)c1cc(cc(C(=O)NCc2c(C)cc(C)[nH]c2=O)c1C)-c1ccc(CN2CCC[C@H](O)C2)cc1