Reaction Details
TargetHistone-lysine N-methyltransferase EZH2
LigandBDBM172135
Substrate/Competitorn/a
Meas. Tech.Enzyme Assay
Temperature298.15±n/a K
IC50 1.51±n/a nM
Commentsextracted
Citation Kuntz, KWChesworth, RDuncan, KWKeilhack, HWarholic, NKlaus, CKnutson, SKWigle, TJSeki, MShirotori, SKawano, S Aryl- or heteroaryl-substituted benzene compounds US Patent US9090562 Publication Date 7/28/2015
 
Histone-lysine N-methyltransferase EZH2
Name:Histone-lysine N-methyltransferase EZH2
Type:Protein
Mol. Mass.:85367.84
Organism:Homo sapiens (Human)
Description:Q15910
Residue:746
BDBM172135
NameBDBM172135
Synonyms:EPZ007210 US11052093, Compound 141 US9175331, 13
TypeSmall organic molecule
Emp. Form.C37H50N5O3
Mol. Mass.612.8246
SMILESCCN([C@H]1CC[C@@H](CC1)N(C)C)c1cc(cc(C(=O)NCc2c(C)cc(C)nc2=O)c1C)-c1ccc(CN2CCOCC2)cc1