Reaction Details
TargetHistone-lysine N-methyltransferase EZH2 [Y641F]
LigandBDBM172074
Substrate/Competitorn/a
Meas. Tech.Enzyme Assay
Temperature298.15±n/a K
IC50 3.88±n/a nM
Commentsextracted
Citation Kuntz, KWChesworth, RDuncan, KWKeilhack, HWarholic, NKlaus, CKnutson, SKWigle, TJSeki, MShirotori, SKawano, S Aryl- or heteroaryl-substituted benzene compounds US Patent US9090562 Publication Date 7/28/2015
 
Histone-lysine N-methyltransferase EZH2 [Y641F]
Name:Histone-lysine N-methyltransferase EZH2 [Y641F]
Type:n/a
Mol. Mass.:85351.84
Organism:Homo sapiens (Human)
Description:Q15910[Y641F]
Residue:746
BDBM172074
NameBDBM172074
Synonyms:US10155002, Compound 80 US9090562, 80
TypeSmall organic molecule
Emp. Form.C35H45FN4O3
Mol. Mass.588.7552
SMILESCCN(C1CCOCC1)c1cc(cc(C(=O)NCc2c(C)cc(C)[nH]c2=O)c1C)-c1ccc(CN2CCC(F)CC2)cc1