Reaction Details
TargetHistone-lysine N-methyltransferase EZH2 [Y641F]
LigandBDBM172088
Substrate/Competitorn/a
Meas. Tech.Enzyme Assay
Temperature298.15±n/a K
IC50 2.07±n/a nM
Commentsextracted
Citation Kuntz, KWChesworth, RDuncan, KWKeilhack, HWarholic, NKlaus, CKnutson, SKWigle, TJSeki, MShirotori, SKawano, S Aryl- or heteroaryl-substituted benzene compounds US Patent US9090562 Publication Date 7/28/2015
 
Histone-lysine N-methyltransferase EZH2 [Y641F]
Name:Histone-lysine N-methyltransferase EZH2 [Y641F]
Type:n/a
Mol. Mass.:85351.84
Organism:Homo sapiens (Human)
Description:Q15910[Y641F]
Residue:746
BDBM172088
NameBDBM172088
Synonyms:US10155002, Compound 94 US9090562, 94
TypeSmall organic molecule
Emp. Form.C34H46N4O3
Mol. Mass.558.754
SMILESCCN(CC)Cc1ccc(cc1)-c1cc(N(CC)C2CCOCC2)c(C)c(c1)C(=O)NCc1c(C)cc(C)[nH]c1=O