Reaction Details
TargetNitric oxide synthase, brain
LigandBDBM50255363
Substrate/Competitorn/a
Meas. Tech.Enzyme Inhibition Assay
Ki 24±n/a nM
Citation Silverman, RBMeyskens, FLYang, SJi, HXue, FPoulos, TL Specific nNOS inhibitors for the therapy and prevention of human melanoma US Patent US9090589 Publication Date 7/28/2015
 
Nitric oxide synthase, brain
Name:Nitric oxide synthase, brain
Type:Homodimer
Mol. Mass.:160985.98
Organism:Homo sapiens (Human)
Description:P29475
Residue:1434
BDBM50255363
NameBDBM50255363
Synonyms:CHEMBL517995 US9090589, 7
TypeSmall organic molecule
Emp. Form.C21H31N5
Mol. Mass.353.5043
SMILESCc1cc(N)nc(C[C@H]2CNC[C@H]2NCCNCCc2ccccc2)c1