Reaction Details
TargetOpioid growth factor receptor-like protein 1
LigandBDBM172444
Substrate/Competitorn/a
Meas. Tech.Radioligand Binding Assay
pH7.4±n/a
Temperature298.15±n/a K
Ki 4.2±0.7 nM
Commentsextracted
Citation Yamawaki, KYao, JYu, JZhou, X Substituted benzimidazole-type piperidine compounds and uses thereof US Patent US9090618 Publication Date 7/28/2015
 
Opioid growth factor receptor-like protein 1
Name:Opioid growth factor receptor-like protein 1
Type:Protein
Mol. Mass.:51247.53
Organism:Homo sapiens (Human)
Description:Q5TC84
Residue:451
BDBM172444
NameBDBM172444
Synonyms:US9090618, ZA67 | US9598411, Ref. No. ZA67
TypeSmall organic molecule
Emp. Form.C28H36N4O
Mol. Mass.444.6116
SMILESCc1cc(no1)-c1nc2ccccc2n1[C@@H]1C[C@@H]2CCC[C@H](C1)N2[C@@H]1C[C@H]2CCC[C@H](C2)C1