Reaction Details
TargetNeuraminidase
LigandBDBM5009
Substrate/CompetitorBDBM4702
Meas. Tech.Neuraminidase Inhibition Assay
pH6.5±n/a
Temperature310.15±n/a K
IC50 1.8±n/a nM
Citation Williams, MALew, WMendel, DBTai, CYEscarpe, PALaver, WGStevens, RCKim, CU Structure-activity relationships of carbocyclic influenza neuraminidase inhibitors Bioorg Med Chem Lett7:1837-42 (1997)    Article
 
Neuraminidase
Name:Neuraminidase
Type:Enzyme
Mol. Mass.:50124.14
Organism:Influenza A virus (A/Puerto Rico/8/34/Mount Sinai(H1N1))
Description:P03468
Residue:454
BDBM5009
BDBM4702
NameBDBM5009
Synonyms:(3R,4R,5S)-4-Acetamido-5-guanidinyl-3-propoxy-1-cyclohexene-1-carboxylic Acid Carbocyclic Analogue 59 | carbocyclic analogue 18
TypeSmall organic molecule
Emp. Form.C13H22N4O4
Mol. Mass.298.3382
SMILESCCCO[C@@H]1C=C(C[C@H](N=C(N)N)[C@H]1NC(C)=O)C(O)=O