Reaction Details
TargetTGF-beta receptor type-1
LigandBDBM172455
Substrate/Competitorn/a
Meas. Tech.Kinase Assay
IC50 6.65±0.61 nM
Citation Barrett, SDKramer, JBBoys, MLChen, H Therapeutic pyrazolyl thienopyridines US Patent US9090625 Publication Date 7/28/2015
 
TGF-beta receptor type-1
Name:TGF-beta receptor type-1
Type:enzyme
Mol. Mass.:55968.24
Organism:Homo sapiens (Human)
Description:P36897
Residue:503
BDBM172455
NameBDBM172455
Synonyms:US9090625, 7 US9938289, 7
TypeSmall organic molecule
Emp. Form.C17H14N4S
Mol. Mass.306.385
SMILESCc1cnn(c1-c1cc2cnccc2s1)-c1cccc(C)n1