Reaction Details
TargetPhosphatidylinositol 4,5-bisphosphate 3-kinase catalytic subunit delta isoform
LigandBDBM172654
Substrate/Competitorn/a
Meas. Tech.Inhibition Assay
pH7.5±n/a
IC50 0.178±n/a nM
Commentsextracted
Citation Heffron, TSafina, BStaben, SSutherlin, DPWei, BElliott, RHeald, RSeward, EMGancia, EWaszkowycz, B Benzoxazepin compounds selective for PI3K P110 delta and methods of use US Patent US9090628 Publication Date 7/28/2015
 
Phosphatidylinositol 4,5-bisphosphate 3-kinase catalytic subunit delta isoform
Name:Phosphatidylinositol 4,5-bisphosphate 3-kinase catalytic subunit delta isoform
Type:Enzyme Subunit
Mol. Mass.:119489.41
Organism:Homo sapiens (Human)
Description:O00329
Residue:1044
BDBM172654
NameBDBM172654
Synonyms:US9090628, 314 US9090628, 320
TypeSmall organic molecule
Emp. Form.C26H35N7O
Mol. Mass.461.6024
SMILESCC(C)n1nc(C)nc1-c1cn2CCOc3cc(ccc3-c2n1)N1CCCC11CCCN(C)C1