Reaction Details
TargetSolute carrier organic anion transporter family member 1B1
LigandBDBM172718
Substrate/Competitorn/a
Meas. Tech.In Vitro Uptake Transporter Assay
pH7.3±n/a
Temperature310.15±n/a K
IC50 850±n/a nM
Commentsextracted
Citation Gregory, MAMoss, SJWilkinson, B Compound and methods for its production US Patent US9090657 Publication Date 7/28/2015
 
Solute carrier organic anion transporter family member 1B1
Name:Solute carrier organic anion transporter family member 1B1
Type:Protein
Mol. Mass.:76468.06
Organism:Homo sapiens (Human)
Description:Q9Y6L6
Residue:691
BDBM172718
NameBDBM172718
Synonyms:US11802108, Compound CSA | US9090657, Cyclosporine A, 1
TypeSmall organic molecule
Emp. Form.C62H111N11O12
Mol. Mass.1202.6112
SMILESCCC1NC(=O)C(C(O)C(C)C\C=C\C)N(C)C(=O)C(C(C)C)N(C)C(=O)C(CC(C)C)N(C)C(=O)C(CC(C)C)N(C)C(=O)C(C)NC(=O)C(C)NC(=O)C(CC(C)C)N(C)C(=O)C(NC(=O)C(CC(C)C)N(C)C(=O)CN(C)C1=O)C(C)C