Reaction Details
TargetSolute carrier organic anion transporter family member 1B3
LigandBDBM172715
Substrate/Competitorn/a
Meas. Tech.In Vitro Uptake Transporter Assay
pH7.3±n/a
Temperature310.15±n/a K
IC50 190±n/a nM
Commentsextracted
Citation Gregory, MAMoss, SJWilkinson, B Compound and methods for its production US Patent US9090657 Publication Date 7/28/2015
 
Solute carrier organic anion transporter family member 1B3
Name:Solute carrier organic anion transporter family member 1B3
Type:Protein
Mol. Mass.:77425.75
Organism:Homo sapiens (Human)
Description:Q9NPD5
Residue:702
BDBM172715
NameBDBM172715
Synonyms:US9090657, DEBIO-025, 2
TypeSmall organic molecule
Emp. Form.C63H113N11O12
Mol. Mass.1216.6378
SMILESCCC1NC(=O)C(C(O)C(C)C\C=C\C)N(C)C(=O)C(C(C)C)N(C)C(=O)C(CC(C)C)N(C)C(=O)C(CC(C)C)N(C)C(=O)C(C)NC(=O)C(C)NC(=O)C(CC(C)C)N(C)C(=O)C(NC(=O)C(C(C)C)N(CC)C(=O)C(C)N(C)C1=O)C(C)C