Reaction Details
TargetSodium-dependent noradrenaline transporter
LigandBDBM172721
Substrate/Competitorn/a
Meas. Tech.Radioligand Binding Assay
Ki 1±n/a nM
Citation Bhat, LAdiey, K Methods of using cycloalkylmethylamine derivatives US Patent US9096515 Publication Date 8/4/2015
 
Sodium-dependent noradrenaline transporter
Name:Sodium-dependent noradrenaline transporter
Type:Multi-pass membrane protein
Mol. Mass.:69337.72
Organism:Homo sapiens (Human)
Description:P23975
Residue:617
BDBM172721
NameBDBM172721
Synonyms:US9096515, 21a | US9296681, 21a
TypeSmall organic molecule
Emp. Form.C20H30Cl2N2O2
Mol. Mass.401.37
SMILESCCOC(=O)NCCNC(CC(C)C)C1(CCC1)c1ccc(Cl)c(Cl)c1